BDBM50301552 CHEMBL585731::trans-methyl 3-(3-(2-(4-(trifluoromethoxy)benzylcarbamoyl)cyclopentyl)-4,5-dihydroisoxazol-5-yl)benzoate
SMILES COC(=O)c1cccc(c1)C1CC(=NO1)[C@@H]1CCC[C@H]1C(=O)NCc1ccc(OC(F)(F)F)cc1
InChI Key InChIKey=DKNYUQXICNUKAL-JLMWTWJWSA-N
Data  1 IC50
  Tab Delimited (TSV)   2D SDfile   Computed 3D by Vconf -m prep SDfile
Find this compound or compounds like it in BindingDB:
Activity Spreadsheet -- Enzyme Inhibition Constant Data from BindingDB
Found 1 hit for monomerid = 50301552
TargetSodium channel protein type 9 subunit alpha(Homo sapiens (Human))
Merck Research Laboratories
Curated by ChEMBL
LigandPNGBDBM50301552(CHEMBL585731 | trans-methyl 3-(3-(2-(4-(trifluorom...)
Affinity DataIC50:  710nM. Assay description: Inhibition of human Nav1.7 channel expressed in HEK cells by FRET assay
In DepthDetails ArticlePubMed