BDBM50302445 3-(3-(6-ethyl-4-(4-(2-phenoxyacetyl)piperazin-1-yl)thieno[2,3-d]pyrimidin-2-yl)ureido)propanoic acid::CHEMBL565840
SMILES CCc1cc2c(nc(NC(=O)NCCC(O)=O)nc2s1)N1CCN(CC1)C(=O)COc1ccccc1
InChI Key InChIKey=NZLROLVZBANOOK-UHFFFAOYSA-N
Data  2 KI
  Tab Delimited (TSV)   2D SDfile   Computed 3D by Vconf -m prep SDfile
Find this compound or compounds like it in BindingDB:
Activity Spreadsheet -- Enzyme Inhibition Constant Data from BindingDB
Found 2 hits for monomerid = 50302445
TargetP2Y purinoceptor 12(Homo sapiens (Human))
Pfizer
Curated by ChEMBL
LigandPNGBDBM50302445(3-(3-(6-ethyl-4-(4-(2-phenoxyacetyl)piperazin-1-yl...)
Affinity DataKi:  539nM. Assay description: Binding affinity to human recombinant P2Y12 receptor expressed on CHO cell membrane
In DepthDetails ArticlePubMed
TargetP2Y purinoceptor 12(Homo sapiens (Human))
Pfizer
Curated by ChEMBL
LigandPNGBDBM50302445(3-(3-(6-ethyl-4-(4-(2-phenoxyacetyl)piperazin-1-yl...)
Affinity DataKi:  593nM. Assay description: Binding affinity to human recombinant P2Y12 receptor expressed in CHO cell membrane in presence of HSA and human AGP
In DepthDetails ArticlePubMed