BDBM50302448 CHEMBL566037::biphenyl-4-yl(4-(6-ethyl-2-(piperazin-1-yl)thieno[2,3-d]pyrimidin-4-yl)piperazin-1-yl)methanone
SMILES CCc1cc2c(nc(nc2s1)N1CCNCC1)N1CCN(CC1)C(=O)c1ccc(cc1)-c1ccccc1
InChI Key InChIKey=LVTKZEJEKSQHMI-UHFFFAOYSA-N
Data  2 KI
  Tab Delimited (TSV)   2D SDfile   Computed 3D by Vconf -m prep SDfile
Find this compound or compounds like it in BindingDB:
Activity Spreadsheet -- Enzyme Inhibition Constant Data from BindingDB
Found 2 hits for monomerid = 50302448
TargetP2Y purinoceptor 12(Homo sapiens (Human))
Pfizer
Curated by ChEMBL
LigandPNGBDBM50302448(CHEMBL566037 | biphenyl-4-yl(4-(6-ethyl-2-(piperaz...)
Affinity DataKi:  397nM. Assay description: Binding affinity to human recombinant P2Y12 receptor expressed in CHO cell membrane in presence of HSA and human AGP
In DepthDetails ArticlePubMed
TargetP2Y purinoceptor 12(Homo sapiens (Human))
Pfizer
Curated by ChEMBL
LigandPNGBDBM50302448(CHEMBL566037 | biphenyl-4-yl(4-(6-ethyl-2-(piperaz...)
Affinity DataKi:  410nM. Assay description: Binding affinity to human recombinant P2Y12 receptor expressed on CHO cell membrane
In DepthDetails ArticlePubMed