BDBM50302699 (S)-5-(4-(butoxycarbonyl)piperazin-1-yl)-4-(6-(4-(dimethylcarbamoyl)piperidin-1-yl)-2-phenylpyrimidine-4-carboxamido)-5-oxopentanoic acid::CHEMBL570289
SMILES CCCCOC(=O)N1CCN(CC1)C(=O)[C@H](CCC(O)=O)NC(=O)c1cc(nc(n1)-c1ccccc1)N1CCC(CC1)C(=O)N(C)C
InChI Key InChIKey=JGMWIMJUKKYDPT-VWLOTQADSA-N
Data  1 KI  1 IC50
  Tab Delimited (TSV)   2D SDfile   Computed 3D by Vconf -m prep SDfile
Find this compound or compounds like it in BindingDB:
Activity Spreadsheet -- Enzyme Inhibition Constant Data from BindingDB
Found 2 hits for monomerid = 50302699
TargetP2Y purinoceptor 12(Homo sapiens (Human))
Pfizer
Curated by ChEMBL
LigandPNGBDBM50302699((S)-5-(4-(butoxycarbonyl)piperazin-1-yl)-4-(6-(4-(...)
Affinity DataKi:  1.30nM. Assay description: Binding affinity at human recombinant P2Y12 receptor expressed in CHO cells by radioligand binding assay
In DepthDetails ArticlePubMed
TargetP2Y purinoceptor 12(Homo sapiens (Human))
Pfizer
Curated by ChEMBL
LigandPNGBDBM50302699((S)-5-(4-(butoxycarbonyl)piperazin-1-yl)-4-(6-(4-(...)
Affinity DataIC50:  1.50E+3nM. Assay description: Antagonist activity at P2Y12 receptor in human platelet rich plasma assessed as inhibition of ADP-induced platelet aggregation by light transmission ...
In DepthDetails ArticlePubMed