BDBM50302911 2-(N-tert-Butylamino)-4'-chloropropiophenone::2-(tert-butylamino)-1-(4-chlorophenyl)propan-1-one::CHEMBL566000
SMILES CC(NC(C)(C)C)C(=O)c1ccc(Cl)cc1
InChI Key InChIKey=IELBAACIVCODPI-UHFFFAOYSA-N
Data  3 KI  5 IC50
  Tab Delimited (TSV)   2D SDfile   Computed 3D by Vconf -m prep SDfile
Find this compound or compounds like it in BindingDB:
Activity Spreadsheet -- Enzyme Inhibition Constant Data from BindingDB
Found 8 hits for monomerid = 50302911
TargetSodium-dependent dopamine transporter(Homo sapiens (Human))
Research Triangle Institute
Curated by ChEMBL
LigandPNGBDBM50302911(2-(N-tert-Butylamino)-4'-chloropropiophenone | 2-(...)
Affinity DataKi:  2.20E+3nM. Assay description: Displacement of [125I]RTI55 from cloned human DAT expressed in HEK293 cellsChecked by Author
In DepthDetails ArticlePubMed
TargetSodium-dependent noradrenaline transporter(Homo sapiens (Human))
Research Triangle Institute
Curated by ChEMBL
LigandPNGBDBM50302911(2-(N-tert-Butylamino)-4'-chloropropiophenone | 2-(...)
Affinity DataKi: >1.00E+4nM. Assay description: Displacement of [125I]RTI55 from cloned human NET expressed in HEK293 cellsChecked by Author
In DepthDetails ArticlePubMed
TargetSodium-dependent serotonin transporter(Homo sapiens (Human))
Research Triangle Institute
Curated by ChEMBL
LigandPNGBDBM50302911(2-(N-tert-Butylamino)-4'-chloropropiophenone | 2-(...)
Affinity DataKi: >1.00E+4nM. Assay description: Displacement of [125I]RTI55 from cloned human SERT expressed in HEK293 cellsChecked by Author
In DepthDetails ArticlePubMed
TargetSodium-dependent dopamine transporter(Homo sapiens (Human))
Research Triangle Institute
Curated by ChEMBL
LigandPNGBDBM50302911(2-(N-tert-Butylamino)-4'-chloropropiophenone | 2-(...)
Affinity DataIC50:  2.32E+3nM. Assay description: Inhibition of [3H]dopamine reuptake at human DAT expressed in HEK293 cellsChecked by Author
In DepthDetails ArticlePubMed
TargetSodium-dependent serotonin transporter(Homo sapiens (Human))
Research Triangle Institute
Curated by ChEMBL
LigandPNGBDBM50302911(2-(N-tert-Butylamino)-4'-chloropropiophenone | 2-(...)
Affinity DataIC50:  9.80E+3nM. Assay description: Inhibition of [3H]serotonin uptake at human SERT expressed in HEK293 cells
In DepthDetails ArticlePubMed
TargetSodium-dependent noradrenaline transporter(Homo sapiens (Human))
Research Triangle Institute
Curated by ChEMBL
LigandPNGBDBM50302911(2-(N-tert-Butylamino)-4'-chloropropiophenone | 2-(...)
Affinity DataIC50:  2.07E+3nM. Assay description: Inhibition of [3H]norepinephrine uptake at human NET expressed in HEK293 cells
In DepthDetails ArticlePubMed
TargetSodium-dependent dopamine transporter(Homo sapiens (Human))
Research Triangle Institute
Curated by ChEMBL
LigandPNGBDBM50302911(2-(N-tert-Butylamino)-4'-chloropropiophenone | 2-(...)
Affinity DataIC50:  1.09E+3nM. Assay description: Inhibition of [3H]dopamine uptake at human DAT expressed in HEK293 cells
In DepthDetails ArticlePubMed
TargetNeuronal acetylcholine receptor subunit alpha-4/beta-2(Homo sapiens (Human))
Research Triangle Institute
Curated by ChEMBL
LigandPNGBDBM50302911(2-(N-tert-Butylamino)-4'-chloropropiophenone | 2-(...)
Affinity DataIC50:  33nM. Assay description: Antagonist activity at human alpha4beta2 nAChR receptor expressed in human SH-SY5Y cells assessed as inhibition of carbamylcholine-induced 86Rb+ effl...
In DepthDetails ArticlePubMed