BDBM50302929 2-(N-tert-Butylamino)-3'-chlorobutyrophenone::2-(tert-butylamino)-1-(3-chlorophenyl)butan-1-one::CHEMBL566886
SMILES CCC(NC(C)(C)C)C(=O)c1cccc(Cl)c1
InChI Key InChIKey=PGTPXIBBHIHMQS-UHFFFAOYSA-N
Data  3 KI  6 IC50
  Tab Delimited (TSV)   2D SDfile   Computed 3D by Vconf -m prep SDfile
Find this compound or compounds like it in BindingDB:
Activity Spreadsheet -- Enzyme Inhibition Constant Data from BindingDB
Found 9 hits for monomerid = 50302929
TargetSodium-dependent dopamine transporter(Homo sapiens (Human))
Research Triangle Institute
Curated by ChEMBL
LigandPNGBDBM50302929(2-(N-tert-Butylamino)-3'-chlorobutyrophenone | 2-(...)
Affinity DataKi:  459nM. Assay description: Displacement of [125I]RTI55 from cloned human DAT expressed in HEK293 cellsChecked by Author
In DepthDetails ArticlePubMed
TargetSodium-dependent noradrenaline transporter(Homo sapiens (Human))
Research Triangle Institute
Curated by ChEMBL
LigandPNGBDBM50302929(2-(N-tert-Butylamino)-3'-chlorobutyrophenone | 2-(...)
Affinity DataKi:  3.20E+3nM. Assay description: Displacement of [125I]RTI55 from cloned human NET expressed in HEK293 cellsChecked by Author
In DepthDetails ArticlePubMed
TargetSodium-dependent serotonin transporter(Homo sapiens (Human))
Research Triangle Institute
Curated by ChEMBL
LigandPNGBDBM50302929(2-(N-tert-Butylamino)-3'-chlorobutyrophenone | 2-(...)
Affinity DataKi: >1.00E+4nM. Assay description: Displacement of [125I]RTI55 from cloned human SERT expressed in HEK293 cellsChecked by Author
In DepthDetails ArticlePubMed
TargetNeuronal acetylcholine receptor subunit alpha-4/beta-2(Homo sapiens (Human))
Research Triangle Institute
Curated by ChEMBL
LigandPNGBDBM50302929(2-(N-tert-Butylamino)-3'-chlorobutyrophenone | 2-(...)
Affinity DataIC50:  8.60nM. Assay description: Antagonist activity at human alpha4beta2 nAChR receptor expressed in human SH-SY5Y cells assessed as inhibition of carbamylcholine-induced 86Rb+ effl...
In DepthDetails ArticlePubMed
TargetSodium-dependent dopamine transporter(Homo sapiens (Human))
Research Triangle Institute
Curated by ChEMBL
LigandPNGBDBM50302929(2-(N-tert-Butylamino)-3'-chlorobutyrophenone | 2-(...)
Affinity DataIC50:  31nM. Assay description: Inhibition of [3H]dopamine reuptake at human DAT expressed in HEK293 cellsChecked by Author
In DepthDetails ArticlePubMed
TargetSodium-dependent dopamine transporter(Homo sapiens (Human))
Research Triangle Institute
Curated by ChEMBL
LigandPNGBDBM50302929(2-(N-tert-Butylamino)-3'-chlorobutyrophenone | 2-(...)
Affinity DataIC50:  209nM. Assay description: Inhibition of [3H]dopamine uptake at human DAT expressed in HEK293 cells
In DepthDetails ArticlePubMed
TargetSodium-dependent serotonin transporter(Homo sapiens (Human))
Research Triangle Institute
Curated by ChEMBL
LigandPNGBDBM50302929(2-(N-tert-Butylamino)-3'-chlorobutyrophenone | 2-(...)
Affinity DataIC50:  1.60E+4nM. Assay description: Inhibition of [3H]serotonin uptake at human SERT expressed in HEK293 cells
In DepthDetails ArticlePubMed
TargetSodium-dependent noradrenaline transporter(Homo sapiens (Human))
Research Triangle Institute
Curated by ChEMBL
LigandPNGBDBM50302929(2-(N-tert-Butylamino)-3'-chlorobutyrophenone | 2-(...)
Affinity DataIC50:  607nM. Assay description: Inhibition of [3H]norepinephrine uptake at human NET expressed in HEK293 cells
In DepthDetails ArticlePubMed
TargetSodium-dependent noradrenaline transporter(Homo sapiens (Human))
Research Triangle Institute
Curated by ChEMBL
LigandPNGBDBM50302929(2-(N-tert-Butylamino)-3'-chlorobutyrophenone | 2-(...)
Affinity DataIC50:  969nM. Assay description: Inhibition of [3H]norepinephrine reuptake at human NET expressed in HEK293 cellsChecked by Author
In DepthDetails ArticlePubMed