BDBM50303176 2-((Z)-4-oxo-5-((E)-3-phenylallylidene)-2-thioxothiazolidin-3-yl)ethane-sulfonic acid::CHEMBL565364
SMILES OS(=O)(=O)CCn1nc(C=CCc2ccccc2)sc1=S
InChI Key InChIKey=UVWAXUCAHPWKBB-UHFFFAOYSA-N
Data  1 KI
  Tab Delimited (TSV)   2D SDfile   Computed 3D by Vconf -m prep SDfile
Find this compound or compounds like it in BindingDB:
Activity Spreadsheet -- Enzyme Inhibition Constant Data from BindingDB
Found 1 hit for monomerid = 50303176
TargetDual specificity protein phosphatase 3(Homo sapiens (Human))
Institute For Medical Research
Curated by ChEMBL
LigandPNGBDBM50303176(2-((Z)-4-oxo-5-((E)-3-phenylallylidene)-2-thioxoth...)
Affinity DataKi:  809nM. Assay description: Inhibition of recombinant vaccina H1-related phosphatase expressed in Escherichia coli by Michaelis-Menton kinetic studies
In DepthDetails ArticlePubMed