BDBM50303185 (E/Z)-5-((1H-pyrrol-2-yl)methylene)-1-(3-chlorophenyl)-2-thioxodihydropyrimidine-4,6(1H,5H)-dione::CHEMBL566855
SMILES Clc1cccc(c1)N1C(=S)NC(=O)C(=Cc2ccc[nH]2)C1=O
InChI Key InChIKey=RRKQGAUZSZJACE-UHFFFAOYSA-N
Data  1 KI
  Tab Delimited (TSV)   2D SDfile   Computed 3D by Vconf -m prep SDfile
Find this compound or compounds like it in BindingDB:
Activity Spreadsheet -- Enzyme Inhibition Constant Data from BindingDB
Found 1 hit for monomerid = 50303185
TargetDual specificity protein phosphatase 3(Homo sapiens (Human))
Institute For Medical Research
Curated by ChEMBL
LigandPNGBDBM50303185((E/Z)-5-((1H-pyrrol-2-yl)methylene)-1-(3-chlorophe...)
Affinity DataKi:  3.49E+3nM. Assay description: Inhibition of recombinant vaccina H1-related phosphatase expressed in Escherichia coli by Michaelis-Menton kinetic studies
In DepthDetails ArticlePubMed