BDBM50303188 4-chloro-N-(2,3,5-trichloro-4-oxocyclohexa-2,5-dienylidene)benzenesulfonamide::CHEMBL565794
SMILES ClC1=C\C(=N/S(=O)(=O)c2ccc(Cl)cc2)C(Cl)=C(Cl)C1=O
InChI Key InChIKey=JIXMIXHCFSEFHF-RQZCQDPDSA-N
Data  1 KI
  Tab Delimited (TSV)   2D SDfile   Computed 3D by Vconf -m prep SDfile
Find this compound or compounds like it in BindingDB:
Activity Spreadsheet -- Enzyme Inhibition Constant Data from BindingDB
Found 1 hit for monomerid = 50303188
TargetDual specificity protein phosphatase 3(Homo sapiens (Human))
Institute For Medical Research
Curated by ChEMBL
LigandPNGBDBM50303188(4-chloro-N-(2,3,5-trichloro-4-oxocyclohexa-2,5-die...)
Affinity DataKi:  1.34E+4nM. Assay description: Inhibition of recombinant vaccina H1-related phosphatase expressed in Escherichia coli by Michaelis-Menton kinetic studies
In DepthDetails ArticlePubMed