BDBM50303946 2-(benzylaminocarbonyloxy-)5-O-(o-amino-benzoyl)-1,4:3,6-dianhydro-D-glucitol::CHEMBL572096
SMILES Nc1ccccc1C(=O)O[C@@H]1CO[C@@H]2[C@H](CO[C@H]12)OC(=O)NCc1ccccc1
InChI Key InChIKey=NUAYGDKUFSIFPR-FCGDIQPGSA-N
Data  1 IC50
  Tab Delimited (TSV)   2D SDfile   Computed 3D by Vconf -m prep SDfile
Find this compound or compounds like it in BindingDB:
Activity Spreadsheet -- Enzyme Inhibition Constant Data from BindingDB
Found 1 hit for monomerid = 50303946
TargetCholinesterase(Homo sapiens (Human))
Trinity College
Curated by ChEMBL
LigandPNGBDBM50303946(2-(benzylaminocarbonyloxy-)5-O-(o-amino-benzoyl)-1...)
Affinity DataIC50:  27nM. Assay description: Inhibition of BuChE in human liver microsomes
In DepthDetails ArticlePubMed