BDBM50305701 CHEMBL593218::methyl 3-(6-(2,4-difluorophenylthio)-[1,2,4]triazolo[4,3-a]pyridin-3-yl)benzoate hydrochloride
SMILES COC(=O)c1cccc(c1)-c1nnc2ccc(Sc3ccc(F)cc3F)cn12
InChI Key InChIKey=CRZMNQPMOPBAMT-UHFFFAOYSA-N
Data  1 IC50
  Tab Delimited (TSV)   2D SDfile   Computed 3D by Vconf -m prep SDfile
Find this compound or compounds like it in BindingDB:
Activity Spreadsheet -- Enzyme Inhibition Constant Data from BindingDB
Found 1 hit for monomerid = 50305701
TargetMitogen-activated protein kinase 14(Homo sapiens (Human))
Pfizer
Curated by ChEMBL
LigandPNGBDBM50305701(CHEMBL593218 | methyl 3-(6-(2,4-difluorophenylthio...)
Affinity DataIC50:  181nM. Assay description: Inhibition of p38 alpha
In DepthDetails ArticlePubMed