BDBM50306596 3-(4-((S)-4-methyl-2-(quinolin-6-ylmethylamino)pentan-2-yl)-1H-1,2,3-triazol-1-yl)-1-(2,3,5,6-tetrafluorophenoxy)heptan-2-one::CHEMBL592404
SMILES CCCCC(C(=O)COc1c(F)c(F)cc(F)c1F)n1cc(nn1)[C@](C)(CC(C)C)NCc1ccc2ncccc2c1
InChI Key InChIKey=KGNPAFUIDAMTOY-KHTLXAHUSA-N
Data  1 KI
  Tab Delimited (TSV)   2D SDfile   Computed 3D by Vconf -m prep SDfile
Find this compound or compounds like it in BindingDB:
Activity Spreadsheet -- Enzyme Inhibition Constant Data from BindingDB
Found 1 hit for monomerid = 50306596
TargetCruzipain(Trypanosoma cruzi)
University Of California
Curated by ChEMBL
LigandPNGBDBM50306596(3-(4-((S)-4-methyl-2-(quinolin-6-ylmethylamino)pen...)
Affinity DataKi:  100nM. Assay description: Inhibition of Trypanosoma cruzi cruzain
In DepthDetails ArticlePubMed