BDBM50306984 (S)-4-(4-(4-(azetidine-1-carbonyl)piperidin-1-yl)-6-phenylpicolinamido)-5-oxo-5-(4-(pentyloxycarbonyl)piperazin-1-yl)pentanoic acid::CHEMBL601905
SMILES CCCCCOC(=O)N1CCN(CC1)C(=O)[C@H](CCC(O)=O)NC(=O)c1cc(cc(n1)-c1ccccc1)N1CCC(CC1)C(=O)N1CCC1
InChI Key InChIKey=YVKOAVOVRUXCEG-LJAQVGFWSA-N
Data  1 KI
  Tab Delimited (TSV)   2D SDfile   Computed 3D by Vconf -m prep SDfile
Find this compound or compounds like it in BindingDB:
Activity Spreadsheet -- Enzyme Inhibition Constant Data from BindingDB
Found 1 hit for monomerid = 50306984
TargetP2Y purinoceptor 12(Homo sapiens (Human))
Pfizer
Curated by ChEMBL
LigandPNGBDBM50306984((S)-4-(4-(4-(azetidine-1-carbonyl)piperidin-1-yl)-...)
Affinity DataKi:  1.20nM. Assay description: Inhibition of human P2Y12 receptor expressed in CHO cells
In DepthDetails ArticlePubMed