BDBM50306996 (S)-5-(4-(butoxycarbonyl)piperazin-1-yl)-5-oxo-4-(4-(4-((2-oxopyrrolidin-1-yl)methyl)piperidin-1-yl)-6-phenylpicolinamido)pentanoic acid::CHEMBL601695
SMILES CCCCOC(=O)N1CCN(CC1)C(=O)[C@H](CCC(O)=O)NC(=O)c1cc(cc(n1)-c1ccccc1)N1CCC(CN2CCCC2=O)CC1
InChI Key InChIKey=SWVNGPOJOZKTNE-LJAQVGFWSA-N
Data  1 KI
  Tab Delimited (TSV)   2D SDfile   Computed 3D by Vconf -m prep SDfile
Find this compound or compounds like it in BindingDB:
Activity Spreadsheet -- Enzyme Inhibition Constant Data from BindingDB
Found 1 hit for monomerid = 50306996
TargetP2Y purinoceptor 12(Homo sapiens (Human))
Pfizer
Curated by ChEMBL
LigandPNGBDBM50306996((S)-5-(4-(butoxycarbonyl)piperazin-1-yl)-5-oxo-4-(...)
Affinity DataKi:  0.790nM. Assay description: Inhibition of human P2Y12 receptor expressed in CHO cells
In DepthDetails ArticlePubMed