BDBM50307417 3-[2-({[1-(3-Fluorophenyl)-3-methylbutyl]amino}carbonyl)-4-(phenoxymethyl)phenyl]propanoic acid::CHEMBL600831
SMILES CC(C)CC(NC(=O)c1cc(COc2ccccc2)ccc1CCC(O)=O)c1cccc(F)c1
InChI Key InChIKey=ZKWLYZRHRQHRJH-UHFFFAOYSA-N
Data  1 KI  1 IC50
  Tab Delimited (TSV)   2D SDfile   Computed 3D by Vconf -m prep SDfile
Find this compound or compounds like it in BindingDB:
Activity Spreadsheet -- Enzyme Inhibition Constant Data from BindingDB
Found 2 hits for monomerid = 50307417
TargetProstaglandin E2 receptor EP3 subtype(Mus musculus (Mouse))
Minase Research Institute
Curated by ChEMBL
LigandPNGBDBM50307417(3-[2-({[1-(3-Fluorophenyl)-3-methylbutyl]amino}car...)
Affinity DataKi:  0.200nM. Assay description: Displacement of [3H]PGE2 from mouse EP3 receptor expressed in CHO cell membrane
In DepthDetails ArticlePubMed
TargetProstaglandin E2 receptor EP3 subtype(Mus musculus (Mouse))
Minase Research Institute
Curated by ChEMBL
LigandPNGBDBM50307417(3-[2-({[1-(3-Fluorophenyl)-3-methylbutyl]amino}car...)
Affinity DataIC50:  40nM. Assay description: Antagonist activity at mouse EP3 receptor expressed in CHO cells assessed as inhibition of PGE2-induced increase intracellular calcium level in prese...
In DepthDetails ArticlePubMed