BDBM50307916 2-(5-((1H-1,2,4-triazol-1-yl)methyl)biphenyl-3-yl)-2-methylpropanenitrile::CHEMBL598224
SMILES CC(C)(C#N)c1cc(Cn2cncn2)cc(c1)-c1ccccc1
InChI Key InChIKey=VEBDRSAIUJIUMQ-UHFFFAOYSA-N
Data  1 IC50
  Tab Delimited (TSV)   2D SDfile   Computed 3D by Vconf -m prep SDfile
Find this compound or compounds like it in BindingDB:
Activity Spreadsheet -- Enzyme Inhibition Constant Data from BindingDB
Found 1 hit for monomerid = 50307916
TargetAromatase(Homo sapiens (Human))
University Of Bath
Curated by ChEMBL
LigandPNGBDBM50307916(2-(5-((1H-1,2,4-triazol-1-yl)methyl)biphenyl-3-yl)...)
Affinity DataIC50:  0.5nM. Assay description: Inhibition of aromatse in human JEG3 cells by scintillation spectrometry
In DepthDetails ArticlePubMed