BDBM50308119 2-(N-Pyrrolidinyl)-3'-methoxypropiophenone::CHEMBL580143
SMILES COc1cccc(c1)C(=O)C(C)N1CCCCC1
InChI Key InChIKey=VIWKHXNVEIOPSC-UHFFFAOYSA-N
Data  4 IC50
  Tab Delimited (TSV)   2D SDfile   Computed 3D by Vconf -m prep SDfile
Find this compound or compounds like it in BindingDB:
Activity Spreadsheet -- Enzyme Inhibition Constant Data from BindingDB
Found 4 hits for monomerid = 50308119
TargetSodium-dependent serotonin transporter(Homo sapiens (Human))
Research Triangle Institute
Curated by ChEMBL
LigandPNGBDBM50308119(2-(N-Pyrrolidinyl)-3'-methoxypropiophenone | CHEMB...)
Affinity DataIC50: >100nM. Assay description: Inhibition of [3H]serotonin uptake at human SERT expressed in HEK293 cells
In DepthDetails ArticlePubMed
TargetNeuronal acetylcholine receptor subunit alpha-4/beta-2(Homo sapiens (Human))
Research Triangle Institute
Curated by ChEMBL
LigandPNGBDBM50308119(2-(N-Pyrrolidinyl)-3'-methoxypropiophenone | CHEMB...)
Affinity DataIC50:  57nM. Assay description: Antagonist activity at human alpha4beta2 nAChR receptor expressed in human SH-SY5Y cells assessed as inhibition of carbamylcholine-induced 86Rb+ effl...
In DepthDetails ArticlePubMed
TargetSodium-dependent dopamine transporter(Homo sapiens (Human))
Research Triangle Institute
Curated by ChEMBL
LigandPNGBDBM50308119(2-(N-Pyrrolidinyl)-3'-methoxypropiophenone | CHEMB...)
Affinity DataIC50:  452nM. Assay description: Inhibition of [3H]dopamine uptake at human DAT expressed in HEK293 cells
In DepthDetails ArticlePubMed
TargetSodium-dependent noradrenaline transporter(Homo sapiens (Human))
Research Triangle Institute
Curated by ChEMBL
LigandPNGBDBM50308119(2-(N-Pyrrolidinyl)-3'-methoxypropiophenone | CHEMB...)
Affinity DataIC50:  718nM. Assay description: Inhibition of [3H]norepinephrine uptake at human NET expressed in HEK293 cells
In DepthDetails ArticlePubMed