BDBM50309003 CHEMBL599153::N-((5-(5-chloro-3-fluoro-2-(2-methyl-2H-tetrazol-5-yl)phenyl)-3-fluoropyridin-2-yl)methyl)-1-ethyl-2-(3-methoxyisoxazole-5-carbonyl)hydrazinecarboxamide
SMILES CCN(NC(=O)c1cc(OC)no1)C(=O)NCc1ncc(cc1F)-c1cc(Cl)cc(F)c1-c1nnn(C)n1
InChI Key InChIKey=CPQOSUWWNIIIDN-UHFFFAOYSA-N
Data  1 IC50
  Tab Delimited (TSV)   2D SDfile   Computed 3D by Vconf -m prep SDfile
Find this compound or compounds like it in BindingDB:
Activity Spreadsheet -- Enzyme Inhibition Constant Data from BindingDB
Found 1 hit for monomerid = 50309003
TargetB1 bradykinin receptor(Homo sapiens (Human))
Jerini
Curated by ChEMBL
LigandPNGBDBM50309003(CHEMBL599153 | N-((5-(5-chloro-3-fluoro-2-(2-methy...)
Affinity DataIC50:  0.200nM. Assay description: Antagonist activity at bradikinin B1 receptor in human IMR90 cells assessed as inhibition of des-Arg-bradykinin-mediated calcium mobilization
In DepthDetails ArticlePubMed