BDBM50309699 CHEMBL597228::benzaldehyde O-4-(heptyloxy)phenylcarbamoyl oxime
SMILES CCCCCCCOc1ccc(NC(=O)O\N=C\c2ccccc2)cc1
InChI Key InChIKey=QGTJCMKYCHZBTK-OQKWZONESA-N
Data  1 IC50
  Tab Delimited (TSV)   2D SDfile   Computed 3D by Vconf -m prep SDfile
Find this compound or compounds like it in BindingDB:
Activity Spreadsheet -- Enzyme Inhibition Constant Data from BindingDB
Found 1 hit for monomerid = 50309699
TargetFatty-acid amide hydrolase 1(Homo sapiens (Human))
Bristol-Myers Squibb Research & Development
Curated by ChEMBL
LigandPNGBDBM50309699(CHEMBL597228 | benzaldehyde O-4-(heptyloxy)phenylc...)
Affinity DataIC50:  8.60nM. Assay description: Inhibition of human FAAH expressed in human H4 cells
In DepthDetails ArticlePubMed