BDBM50309722 CHEMBL598556::nicotinaldehyde O-4-(octyloxy)phenylcarbamoyl oxime
SMILES CCCCCCCCOc1ccc(NC(=O)O\N=C\c2cccnc2)cc1
InChI Key InChIKey=OVFNTSYUCWVKBI-HAVVHWLPSA-N
Data  1 IC50
  Tab Delimited (TSV)   2D SDfile   Computed 3D by Vconf -m prep SDfile
Find this compound or compounds like it in BindingDB:
Activity Spreadsheet -- Enzyme Inhibition Constant Data from BindingDB
Found 1 hit for monomerid = 50309722
TargetFatty-acid amide hydrolase 1(Homo sapiens (Human))
Bristol-Myers Squibb Research & Development
Curated by ChEMBL
LigandPNGBDBM50309722(CHEMBL598556 | nicotinaldehyde O-4-(octyloxy)pheny...)
Affinity DataIC50:  0.800nM. Assay description: Inhibition of human FAAH expressed in human H4 cells
In DepthDetails ArticlePubMed