BDBM50310102 (E)-(2-(hydroxymethyl)-4-(8-methoxyoctylidene)-5-oxotetrahydrofuran-2-yl)methyl pivalate::CHEMBL598241
SMILES COCCCCCCC\C=C1/CC(CO)(COC(=O)C(C)(C)C)OC1=O
InChI Key InChIKey=NSOLGCWVMPGQSG-LFIBNONCSA-N
Data  1 KI
  Tab Delimited (TSV)   2D SDfile   Computed 3D by Vconf -m prep SDfile
Find this compound or compounds like it in BindingDB:
Activity Spreadsheet -- Enzyme Inhibition Constant Data from BindingDB
Found 1 hit for monomerid = 50310102
TargetProtein kinase C alpha type(Homo sapiens (Human))
Seoul National University
Curated by ChEMBL
LigandPNGBDBM50310102((E)-(2-(hydroxymethyl)-4-(8-methoxyoctylidene)-5-o...)
Affinity DataKi:  191nM. Assay description: Displacement of [20-3H]phorbol 12,13-dibutyrate from recombinant PKCalpha
In DepthDetails ArticlePubMed