BDBM50312230 CHEMBL1081583::difluoro(4-nitrophenyl)methylphosphonic acid
SMILES OP(O)(=O)C(F)(F)c1ccc(cc1)[N+]([O-])=O
InChI Key InChIKey=XQJJRBXROZSAMH-UHFFFAOYSA-N
Data  1 KI
  Tab Delimited (TSV)   2D SDfile   Computed 3D by Vconf -m prep SDfile
Find this compound or compounds like it in BindingDB:
Activity Spreadsheet -- Enzyme Inhibition Constant Data from BindingDB
Found 1 hit for monomerid = 50312230
TargetLow molecular weight protein-tyrosine phosphatase A(Mycobacterium tuberculosis)
University Of California
Curated by ChEMBL
LigandPNGBDBM50312230(CHEMBL1081583 | difluoro(4-nitrophenyl)methylphosp...)
Affinity DataKi:  7.54E+4nM. Assay description: Inhibition of Mycobacterium tuberculosis PtpA
In DepthDetails ArticlePubMed