BDBM50312242 (4-(benzylcarbamoyl)phenyl)difluoromethylphosphonic acid::CHEMBL1080016
SMILES OP(O)(=O)C(F)(F)c1ccc(cc1)C(=O)NCc1ccccc1
InChI Key InChIKey=GHQAAZGMNGYGJX-UHFFFAOYSA-N
Data  1 KI
  Tab Delimited (TSV)   2D SDfile   Computed 3D by Vconf -m prep SDfile
Find this compound or compounds like it in BindingDB:
Activity Spreadsheet -- Enzyme Inhibition Constant Data from BindingDB
Found 1 hit for monomerid = 50312242
TargetLow molecular weight protein-tyrosine phosphatase A(Mycobacterium tuberculosis)
University Of California
Curated by ChEMBL
LigandPNGBDBM50312242((4-(benzylcarbamoyl)phenyl)difluoromethylphosphoni...)
Affinity DataKi:  4.31E+4nM. Assay description: Inhibition of Mycobacterium tuberculosis PtpA
In DepthDetails ArticlePubMed