BDBM50314869 CHEMBL4167274
SMILES [H][C@]12C[C@H](CC(=O)NCCc3ccc(Cl)cc3)C=C[C@]1([C@H](\C=C(/Cl)c1ccc(cc1)C(=O)OC)C=C(C)C2)C(=O)OC
InChI Key InChIKey=CGKNKOACFIAUOY-BOJQMAGNSA-N
Data  3 KI
  Tab Delimited (TSV)   2D SDfile   Computed 3D by Vconf -m prep SDfile
Find this compound or compounds like it in BindingDB:
Activity Spreadsheet -- Enzyme Inhibition Constant Data from BindingDB
Found 3 hits for monomerid = 50314869
TargetInduced myeloid leukemia cell differentiation protein Mcl-1 homolog(Mus musculus (Mouse))
Universit£
Curated by ChEMBL
LigandPNGBDBM50314869(CHEMBL4167274)
Affinity DataKi:  8.38E+3nM. Assay description: Antagonist activity against Nicotinic acetylcholine receptor (nAChR) of isolated Frog rectus Abdominis Muscle
In DepthDetails ArticlePubMed
TargetApoptosis regulator Bcl-2(Homo sapiens (Human))
Universit£
Curated by ChEMBL
LigandPNGBDBM50314869(CHEMBL4167274)
Affinity DataKi: >2.30E+4nM. Assay description: Antagonist activity against Nicotinic acetylcholine receptor (nAChR) of isolated Frog rectus Abdominis Muscle
In DepthDetails ArticlePubMed
TargetBcl-2-like protein 1(Homo sapiens (Human))
Universit£
Curated by ChEMBL
LigandPNGBDBM50314869(CHEMBL4167274)
Affinity DataKi: >2.30E+4nM. Assay description: Antagonist activity against Nicotinic acetylcholine receptor (nAChR) of isolated Frog rectus Abdominis Muscle
In DepthDetails ArticlePubMed