BDBM50314874 CHEMBL4176611
SMILES [H][C@]12C[C@H](CC(=O)Nc3ccc(Cl)cc3)C=C[C@]1([C@H](\C=C(/Cl)c1ccc(cc1)C(O)=O)C=C(C)C2)C(=O)OC
InChI Key InChIKey=VVILYNHSRXZKRA-YPNFLZGNSA-N
Data  3 KI
  Tab Delimited (TSV)   2D SDfile   Computed 3D by Vconf -m prep SDfile
Find this compound or compounds like it in BindingDB:
Activity Spreadsheet -- Enzyme Inhibition Constant Data from BindingDB
Found 3 hits for monomerid = 50314874
TargetApoptosis regulator Bcl-2(Homo sapiens (Human))
Universit£
Curated by ChEMBL
LigandPNGBDBM50314874(CHEMBL4176611)
Affinity DataKi:  700nM. Assay description: Inhibition of FITC-Ahx-Bim-OH binding to human Bcl2 isoform 2 after 2 hrs by fluorescent polarization assay
In DepthDetails ArticlePubMed
TargetInduced myeloid leukemia cell differentiation protein Mcl-1 homolog(Mus musculus (Mouse))
Universit£
Curated by ChEMBL
LigandPNGBDBM50314874(CHEMBL4176611)
Affinity DataKi:  1.00E+3nM. Assay description: Inhibition of FITC-Ahx-Bid-OH binding to mouse DN150/DC25 Mcl-1 after 2 hrs by fluorescent polarization assay
In DepthDetails ArticlePubMed
TargetBcl-2-like protein 1(Homo sapiens (Human))
Universit£
Curated by ChEMBL
LigandPNGBDBM50314874(CHEMBL4176611)
Affinity DataKi:  2.74E+3nM. Assay description: Antagonist activity against Nicotinic acetylcholine receptor (nAChR) of isolated Frog rectus Abdominis Muscle
In DepthDetails ArticlePubMed