BDBM50315604 2-(furan-2-yl)-5-(methylthio)-[1,2,4]triazolo[1,5-a][1,3,5]triazin-7-amine::CHEMBL1090123
SMILES CSc1nc(N)n2nc(nc2n1)-c1ccco1
InChI Key InChIKey=APSHQFCMMKRIFB-UHFFFAOYSA-N
Data  3 KI  1 EC50
  Tab Delimited (TSV)   2D SDfile   Computed 3D by Vconf -m prep SDfile
Find this compound or compounds like it in BindingDB:
Activity Spreadsheet -- Enzyme Inhibition Constant Data from BindingDB
Found 3 hits for monomerid = 50315604
TargetAdenosine receptor A2a(Rattus norvegicus (rat))
National University Of Singapore
Curated by ChEMBL
LigandPNGBDBM50315604(2-(furan-2-yl)-5-(methylthio)-[1,2,4]triazolo[1,5-...)
Affinity DataKi:  96.5nM. Assay description: Displacement of [3H]CGS21680 from adenosine A2A receptor in rat striatal membrane
In DepthDetails ArticlePubMed
TargetAdenosine receptor A1(Rattus norvegicus (rat))
National University Of Singapore
Curated by ChEMBL
LigandPNGBDBM50315604(2-(furan-2-yl)-5-(methylthio)-[1,2,4]triazolo[1,5-...)
Affinity DataKi:  1.73E+3nM. Assay description: Displacement of [3H]R-PIA from adenosine A1 receptor in rat cerebral cortex membrane
In DepthDetails ArticlePubMed
TargetAdenosine receptor A3(Homo sapiens (Human))
National University Of Singapore
Curated by ChEMBL
LigandPNGBDBM50315604(2-(furan-2-yl)-5-(methylthio)-[1,2,4]triazolo[1,5-...)
Affinity DataKi:  2.58E+3nM. Assay description: Displacement of [125I]-I-AB-MECA from human adenosine A3 receptor expressed in CHO cells
In DepthDetails ArticlePubMed