BDBM50315804 2-amino-4-(3-chloro-4'-pentylbiphenyl-4-yl)-2-(hydroxymethyl)butyl dihydrogen phosphate::CHEMBL1096210
SMILES CCCCCc1ccc(cc1)-c1ccc(CCC(N)(CO)COP(O)(O)=O)c(Cl)c1
InChI Key InChIKey=VYKOHCADRJRQNT-UHFFFAOYSA-N
Data  2 EC50
  Tab Delimited (TSV)   2D SDfile   Computed 3D by Vconf -m prep SDfile
Find this compound or compounds like it in BindingDB:
Activity Spreadsheet -- Enzyme Inhibition Constant Data from BindingDB
Found 2 hits for monomerid = 50315804
TargetSphingosine 1-phosphate receptor 3(Homo sapiens (Human))
Mitsubishi Tanabe Pharma
Curated by ChEMBL
LigandPNGBDBM50315804(2-amino-4-(3-chloro-4'-pentylbiphenyl-4-yl)-2-(hyd...)
Affinity DataEC50: >1.00E+3nM. Assay description: Agonist activity at human S1P3 receptor expressed in CHO cells assessed as intracellular calcium mobilization
In DepthDetails ArticlePubMed
TargetSphingosine 1-phosphate receptor 1(Homo sapiens (Human))
Mitsubishi Tanabe Pharma
Curated by ChEMBL
LigandPNGBDBM50315804(2-amino-4-(3-chloro-4'-pentylbiphenyl-4-yl)-2-(hyd...)
Affinity DataEC50:  0.640nM. Assay description: Agonist activity at human S1P1 receptor expressed in human Chem1 cells assessed as intracellular calcium mobilization
In DepthDetails ArticlePubMed