BDBM50317996 CHEMBL1097651::N-(2-amino-5-(furan-2-yl)phenyl)benzamide
SMILES Nc1ccc(cc1NC(=O)c1ccccc1)-c1ccco1
InChI Key InChIKey=POPIQEQSLAJUGU-UHFFFAOYSA-N
Data  2 IC50
  Tab Delimited (TSV)   2D SDfile   Computed 3D by Vconf -m prep SDfile
Find this compound or compounds like it in BindingDB:
Activity Spreadsheet -- Enzyme Inhibition Constant Data from BindingDB
Found 2 hits for monomerid = 50317996
TargetHistone deacetylase 2(Homo sapiens (Human))
Takeda California
Curated by ChEMBL
LigandPNGBDBM50317996(CHEMBL1097651 | N-(2-amino-5-(furan-2-yl)phenyl)be...)
Affinity DataIC50:  1.80E+3nM. Assay description: Inhibition of human recombinant HDAC2 preincubated for 1 hr with substrate by protease coupled end-point assay
In DepthDetails ArticlePubMed
TargetHistone deacetylase 2(Homo sapiens (Human))
Takeda California
Curated by ChEMBL
LigandPNGBDBM50317996(CHEMBL1097651 | N-(2-amino-5-(furan-2-yl)phenyl)be...)
Affinity DataIC50:  43nM. Assay description: Inhibition of human recombinant HDAC2 preincubated for 24 hrs followed by 1 hr reaction with substrate by protease coupled end-point assay
In DepthDetails ArticlePubMed