BDBM50318001 CHEMBL1096398::N-(2-amino-5-(benzo[b]thiophen-2-yl)phenyl)benzamide
SMILES Nc1ccc(cc1NC(=O)c1ccccc1)-c1cc2ccccc2s1
InChI Key InChIKey=WTHSADGCIQFDMQ-UHFFFAOYSA-N
Data  2 IC50
  Tab Delimited (TSV)   2D SDfile   Computed 3D by Vconf -m prep SDfile
Find this compound or compounds like it in BindingDB:
Activity Spreadsheet -- Enzyme Inhibition Constant Data from BindingDB
Found 2 hits for monomerid = 50318001
TargetHistone deacetylase 2(Homo sapiens (Human))
Takeda California
Curated by ChEMBL
LigandPNGBDBM50318001(CHEMBL1096398 | N-(2-amino-5-(benzo[b]thiophen-2-y...)
Affinity DataIC50:  1.00E+4nM. Assay description: Inhibition of human recombinant HDAC2 preincubated for 1 hr with substrate by protease coupled end-point assay
In DepthDetails ArticlePubMed
TargetHistone deacetylase 2(Homo sapiens (Human))
Takeda California
Curated by ChEMBL
LigandPNGBDBM50318001(CHEMBL1096398 | N-(2-amino-5-(benzo[b]thiophen-2-y...)
Affinity DataIC50:  1.00E+4nM. Assay description: Inhibition of human recombinant HDAC2 preincubated for 24 hrs followed by 1 hr reaction with substrate by protease coupled end-point assay
In DepthDetails ArticlePubMed