BDBM50318002 CHEMBL1096397::N-(4-amino-4'-vinylbiphenyl-3-yl)benzamide
SMILES Nc1ccc(cc1NC(=O)c1ccccc1)-c1ccc(C=C)cc1
InChI Key InChIKey=GUBGWFHGNFMNFP-UHFFFAOYSA-N
Data  2 IC50
  Tab Delimited (TSV)   2D SDfile   Computed 3D by Vconf -m prep SDfile
Find this compound or compounds like it in BindingDB:
Activity Spreadsheet -- Enzyme Inhibition Constant Data from BindingDB
Found 2 hits for monomerid = 50318002
TargetHistone deacetylase 2(Homo sapiens (Human))
Takeda California
Curated by ChEMBL
LigandPNGBDBM50318002(CHEMBL1096397 | N-(4-amino-4'-vinylbiphenyl-3-yl)b...)
Affinity DataIC50:  5.00E+3nM. Assay description: Inhibition of human recombinant HDAC2 preincubated for 1 hr with substrate by protease coupled end-point assay
In DepthDetails ArticlePubMed
TargetHistone deacetylase 2(Homo sapiens (Human))
Takeda California
Curated by ChEMBL
LigandPNGBDBM50318002(CHEMBL1096397 | N-(4-amino-4'-vinylbiphenyl-3-yl)b...)
Affinity DataIC50:  800nM. Assay description: Inhibition of human recombinant HDAC2 preincubated for 24 hrs followed by 1 hr reaction with substrate by protease coupled end-point assay
In DepthDetails ArticlePubMed