BDBM50319208 6-[3-(4-Chloro-benzoyl)-ureido]-hexanoic acid hydroxyamide::CHEMBL1084283
SMILES ONC(=O)CCCCCNC(=O)NC(=O)c1ccc(Cl)cc1
InChI Key InChIKey=SZXKMGUTGNVAMC-UHFFFAOYSA-N
Data  2 IC50
  Tab Delimited (TSV)   2D SDfile   Computed 3D by Vconf -m prep SDfile
Find this compound or compounds like it in BindingDB:
Activity Spreadsheet -- Enzyme Inhibition Constant Data from BindingDB
Found 2 hits for monomerid = 50319208
TargetHistone deacetylase 1(Homo sapiens (Human))
S*Bio
Curated by ChEMBL
LigandPNGBDBM50319208(6-[3-(4-Chloro-benzoyl)-ureido]-hexanoic acid hydr...)
Affinity DataIC50:  26nM. Assay description: Inhibition of HDAC1 in human COLO205 cells assessed as induction of histone H3 acetylation
In DepthDetails ArticlePubMed
TargetHistone deacetylase 1(Homo sapiens (Human))
S*Bio
Curated by ChEMBL
LigandPNGBDBM50319208(6-[3-(4-Chloro-benzoyl)-ureido]-hexanoic acid hydr...)
Affinity DataIC50:  1.60E+3nM. Assay description: Inhibition of HDAC1 in human COLO205 cells assessed as induction of histone H3 acetylation
In DepthDetails ArticlePubMed