BDBM50319234 4-(3-Benzoyl-ureido)-N-hydroxy-butyramide::CHEMBL1083438
SMILES ONC(=O)CCCNC(=O)NC(=O)c1ccccc1
InChI Key InChIKey=VUXVREHFAAEDJQ-UHFFFAOYSA-N
Data  2 IC50
  Tab Delimited (TSV)   2D SDfile   Computed 3D by Vconf -m prep SDfile
Find this compound or compounds like it in BindingDB:
Activity Spreadsheet -- Enzyme Inhibition Constant Data from BindingDB
Found 2 hits for monomerid = 50319234
TargetHistone deacetylase 1(Homo sapiens (Human))
S*Bio
Curated by ChEMBL
LigandPNGBDBM50319234(4-(3-Benzoyl-ureido)-N-hydroxy-butyramide | CHEMBL...)
Affinity DataIC50: >1.00E+4nM. Assay description: Inhibition of HDAC1 in human COLO205 cells assessed as induction of histone H3 acetylation
In DepthDetails ArticlePubMed
TargetHistone deacetylase 8(Homo sapiens (Human))
S*Bio
Curated by ChEMBL
LigandPNGBDBM50319234(4-(3-Benzoyl-ureido)-N-hydroxy-butyramide | CHEMBL...)
Affinity DataIC50: >1.00E+4nM. Assay description: Inhibition of HDAC8
In DepthDetails ArticlePubMed