BDBM50319238 6-[3-benzoyl-1-(3-phenyl-propyl)-ureido]-hexanoic acid hydroxyamide::CHEMBL1083742
SMILES ONC(=O)CCCCCN(CCCc1ccccc1)C(=O)NC(=O)c1ccccc1
InChI Key InChIKey=LZQLHQNNAVPNSB-UHFFFAOYSA-N
Data  2 IC50
  Tab Delimited (TSV)   2D SDfile   Computed 3D by Vconf -m prep SDfile
Find this compound or compounds like it in BindingDB:
Activity Spreadsheet -- Enzyme Inhibition Constant Data from BindingDB
Found 2 hits for monomerid = 50319238
TargetHistone deacetylase 1(Homo sapiens (Human))
S*Bio
Curated by ChEMBL
LigandPNGBDBM50319238(6-[3-benzoyl-1-(3-phenyl-propyl)-ureido]-hexanoic ...)
Affinity DataIC50:  392nM. Assay description: Inhibition of HDAC1 in human COLO205 cells assessed as induction of histone H3 acetylation
In DepthDetails ArticlePubMed
TargetHistone deacetylase 8(Homo sapiens (Human))
S*Bio
Curated by ChEMBL
LigandPNGBDBM50319238(6-[3-benzoyl-1-(3-phenyl-propyl)-ureido]-hexanoic ...)
Affinity DataIC50:  328nM. Assay description: Inhibition of HDAC8
In DepthDetails ArticlePubMed