BDBM50320800 CHEMBL1164674::N-{4-[3-(b-Alanylamino)phenyl]-3-cyano-6-(2-hydroxyphenyl)pyridin-2-yl}thiophene-2-carboxamide
SMILES NCCC(=O)Nc1cccc(c1)-c1cc(nc(NC(=O)c2cccs2)c1C#N)-c1ccccc1O
InChI Key InChIKey=XHNROVWJZRHLIY-UHFFFAOYSA-N
Data  2 IC50
  Tab Delimited (TSV)   2D SDfile   Computed 3D by Vconf -m prep SDfile
Find this compound or compounds like it in BindingDB:
Activity Spreadsheet -- Enzyme Inhibition Constant Data from BindingDB
Found 2 hits for monomerid = 50320800
TargetKiSS-1 receptor(Homo sapiens (Human))
Takeda Pharmaceutical
Curated by ChEMBL
LigandPNGBDBM50320800(CHEMBL1164674 | N-{4-[3-(b-Alanylamino)phenyl]-3-c...)
Affinity DataIC50:  1.10E+3nM. Assay description: Antagonist activity at human GPR54 receptor expressed in CHO cells assessed as inhibition of metastin(40-54)-induced intracellular calcium mobilizati...
In DepthDetails ArticlePubMed
TargetKiSS-1 receptor(Homo sapiens (Human))
Takeda Pharmaceutical
Curated by ChEMBL
LigandPNGBDBM50320800(CHEMBL1164674 | N-{4-[3-(b-Alanylamino)phenyl]-3-c...)
Affinity DataIC50:  21nM. Assay description: Displacement of [125I]metastin(40-54) from human GPR54 receptor expressed in CHO cells after 60 mins by scintillation counting
In DepthDetails ArticlePubMed