BDBM50320803 CHEMBL1164154::N-[4-{2-[(2-Aminoethyl)carbamoyl]phenyl}-3-cyano-6-(2-hydroxyphenyl)pyridin-2-yl]thiophene-2-carboxamide
SMILES NCCNC(=O)c1ccccc1-c1cc(nc(NC(=O)c2cccs2)c1C#N)-c1ccccc1O
InChI Key InChIKey=NMRBPCGLKYXXHS-UHFFFAOYSA-N
Data  1 IC50
  Tab Delimited (TSV)   2D SDfile   Computed 3D by Vconf -m prep SDfile
Find this compound or compounds like it in BindingDB:
Activity Spreadsheet -- Enzyme Inhibition Constant Data from BindingDB
Found 1 hit for monomerid = 50320803
TargetKiSS-1 receptor(Homo sapiens (Human))
Takeda Pharmaceutical
Curated by ChEMBL
LigandPNGBDBM50320803(CHEMBL1164154 | N-[4-{2-[(2-Aminoethyl)carbamoyl]p...)
Affinity DataIC50:  3.30E+4nM. Assay description: Displacement of [125I]metastin(40-54) from human GPR54 receptor expressed in CHO cells after 60 mins by scintillation counting
In DepthDetails ArticlePubMed