BDBM50321650 (4-(3-(1H-pyrazol-4-yl)imidazo[1,2-a]pyrazin-6-yl)phenyl)methanamine::CHEMBL1170747
SMILES NCc1ccc(cc1)-c1cn2c(cnc2cn1)-c1cn[nH]c1
InChI Key InChIKey=HRKWURYEAYZSRP-UHFFFAOYSA-N
Data  4 IC50
  Tab Delimited (TSV)   2D SDfile   Computed 3D by Vconf -m prep SDfile
Find this compound or compounds like it in BindingDB:
Activity Spreadsheet -- Enzyme Inhibition Constant Data from BindingDB
Found 4 hits for monomerid = 50321650
TargetSerine/threonine-protein kinase Chk1(Homo sapiens (Human))
The Institute Of Cancer Research
Curated by ChEMBL
LigandPNGBDBM50321650((4-(3-(1H-pyrazol-4-yl)imidazo[1,2-a]pyrazin-6-yl)...)
Affinity DataIC50:  2.00E+3nM. Assay description: Inhibition of CHK1 by DELFIA
In DepthDetails ArticlePubMed
TargetSerine/threonine-protein kinase Chk1(Homo sapiens (Human))
The Institute Of Cancer Research
Curated by ChEMBL
LigandPNGBDBM50321650((4-(3-(1H-pyrazol-4-yl)imidazo[1,2-a]pyrazin-6-yl)...)
Affinity DataIC50:  5.01E+8nM. Assay description: Inhibition of CHK1 (unknown origin) assessed as inhibition of CDC25 phosphorylation after 30 min by DELFIA assay
In DepthDetails Article
TargetTyrosine-protein kinase ABL1(Homo sapiens (Human))
The Institute Of Cancer Research
Curated by ChEMBL
LigandPNGBDBM50321650((4-(3-(1H-pyrazol-4-yl)imidazo[1,2-a]pyrazin-6-yl)...)
Affinity DataIC50:  240nM. Assay description: Inhibition of ABL1 by Z-lite assay
In DepthDetails ArticlePubMed
TargetSerine/threonine-protein kinase Chk2(Homo sapiens (Human))
The Institute Of Cancer Research
Curated by ChEMBL
LigandPNGBDBM50321650((4-(3-(1H-pyrazol-4-yl)imidazo[1,2-a]pyrazin-6-yl)...)
Affinity DataIC50:  120nM. Assay description: Inhibition of CHK2 by DELFIA assay
In DepthDetails ArticlePubMed