BDBM50321672 3-(6-(1H-pyrazol-4-yl)imidazo[1,2-a]pyrazin-3-yl)aniline::CHEMBL1169926
SMILES Nc1cccc(c1)-c1cnc2cnc(cn12)-c1cn[nH]c1
InChI Key InChIKey=IZMRSQDIWPRDRS-UHFFFAOYSA-N
Data  2 IC50
  Tab Delimited (TSV)   2D SDfile   Computed 3D by Vconf -m prep SDfile
Find this compound or compounds like it in BindingDB:
Activity Spreadsheet -- Enzyme Inhibition Constant Data from BindingDB
Found 2 hits for monomerid = 50321672
TargetSerine/threonine-protein kinase Chk1(Homo sapiens (Human))TBA
LigandPNGBDBM50321672(3-(6-(1H-pyrazol-4-yl)imidazo[1,2-a]pyrazin-3-yl)a...)
Affinity DataIC50:  1.00E+7nM. Assay description: Inhibition of CHK1 (unknown origin) assessed as inhibition of CDC25 phosphorylation after 30 min by DELFIA assay
In DepthDetails Article
TargetSerine/threonine-protein kinase Chk1(Homo sapiens (Human))TBA
LigandPNGBDBM50321672(3-(6-(1H-pyrazol-4-yl)imidazo[1,2-a]pyrazin-3-yl)a...)
Affinity DataIC50: >1.00E+5nM. Assay description: Inhibition of CHK1 by DELFIA
In DepthDetails ArticlePubMed