BDBM50321825 4-((1H-Imidazol-4-yl)methyl)-1-(4-tert-butylphenyl)piperidine::CHEMBL1172776
SMILES CC(C)(C)c1ccc(cc1)N1CCC(Cc2cnc[nH]2)CC1
InChI Key InChIKey=NBNVWUUSIXACRE-UHFFFAOYSA-N
Data  1 KI  1 EC50
  Tab Delimited (TSV)   2D SDfile   Computed 3D by Vconf -m prep SDfile
Find this compound or compounds like it in BindingDB:
Activity Spreadsheet -- Enzyme Inhibition Constant Data from BindingDB
Found 2 hits for monomerid = 50321825
TargetHistamine H3 receptor(Homo sapiens (Human))
Meiji Seika Kaisha
Curated by ChEMBL
LigandPNGBDBM50321825(4-((1H-Imidazol-4-yl)methyl)-1-(4-tert-butylphenyl...)
Affinity DataKi:  14nM. Assay description: Displacement of [3H] (R)-alpha-methylhistamine from human recombinant histamine H3 receptor expressed in CHO cells after 1 hr by liquid scintillation...
In DepthDetails ArticlePubMed
TargetHistamine H3 receptor(Homo sapiens (Human))
Meiji Seika Kaisha
Curated by ChEMBL
LigandPNGBDBM50321825(4-((1H-Imidazol-4-yl)methyl)-1-(4-tert-butylphenyl...)
Affinity DataEC50:  18nM. Assay description: Agonist activity at human recombinant histamine H3 receptor expressed in CHO-K1 cells assessed as [35S]GTPgammaS binding after 1 hr by liquid scintil...
In DepthDetails ArticlePubMed