BDBM50324860 1-benzoyl-2-acetyllycorine::CHEMBL1222026
SMILES CC(=O)O[C@H]1C=C2CCN3Cc4cc5OCOc5cc4[C@@H]([C@@H]23)[C@@H]1OC(=O)c1ccccc1
InChI Key InChIKey=CWFZBOLWWVLFLC-CJRSTVEYSA-N
Data  1 KI
  Tab Delimited (TSV)   2D SDfile   Computed 3D by Vconf -m prep SDfile
Find this compound or compounds like it in BindingDB:
Activity Spreadsheet -- Enzyme Inhibition Constant Data from BindingDB
Found 1 hit for monomerid = 50324860
TargetAcetylcholinesterase(Homo sapiens (Human))
Mcmaster University
Curated by ChEMBL
LigandPNGBDBM50324860(1-benzoyl-2-acetyllycorine | CHEMBL1222026)
Affinity DataKi:  970nM. Assay description: Inhibition of AChE by Ellman's assay
In DepthDetails ArticlePubMed