BDBM50327124 (+/-)-threo-N-(4-Methoxybenzyl)methylphenidate::CHEMBL1255100
SMILES COC(=O)[C@@H]([C@H]1CCCCN1Cc1ccc(OC)cc1)c1ccccc1
InChI Key InChIKey=PMKFGPNZRGUOSJ-NHCUHLMSSA-N
Data  1 IC50
  Tab Delimited (TSV)   2D SDfile   Computed 3D by Vconf -m prep SDfile
Find this compound or compounds like it in BindingDB:
Activity Spreadsheet -- Enzyme Inhibition Constant Data from BindingDB
Found 1 hit for monomerid = 50327124
TargetSodium-dependent dopamine transporter(Rattus norvegicus (rat))
Institute Of Technology
Curated by ChEMBL
LigandPNGBDBM50327124((+/-)-threo-N-(4-Methoxybenzyl)methylphenidate | C...)
Affinity DataIC50:  79.1nM. Assay description: Displacement of [3H]WIN 35428 from Sprague-Dawley rat striatal tissue after 2 hrs by liquid scintillation counting
In DepthDetails ArticlePubMed