BDBM50327531 2-(4-bromophenyl)-N-((7-methoxy-2-(oxazol-2-yl)quinolin-3-yl)methyl)ethanamine::CHEMBL1257142
SMILES COc1ccc2cc(CNCCc3ccc(Br)cc3)c(nc2c1)-c1ncco1
InChI Key InChIKey=KGUAJOIDQISJTF-UHFFFAOYSA-N
Data  2 IC50
  Tab Delimited (TSV)   2D SDfile   Computed 3D by Vconf -m prep SDfile
Find this compound or compounds like it in BindingDB:
Activity Spreadsheet -- Enzyme Inhibition Constant Data from BindingDB
Found 2 hits for monomerid = 50327531
TargetG-protein coupled bile acid receptor 1(Mus musculus)
Kalypsys
Curated by ChEMBL
LigandPNGBDBM50327531(2-(4-bromophenyl)-N-((7-methoxy-2-(oxazol-2-yl)qui...)
Affinity DataIC50: >1.00E+4nM. Assay description: Agonist activity at mouse TGR5 receptor expressed in HEK293 cells assessed as intracellular cAMP level
In DepthDetails ArticlePubMed
TargetG-protein coupled bile acid receptor 1(Homo sapiens (Human))
Kalypsys
Curated by ChEMBL
LigandPNGBDBM50327531(2-(4-bromophenyl)-N-((7-methoxy-2-(oxazol-2-yl)qui...)
Affinity DataIC50:  2.70E+3nM. Assay description: Agonist activity at human TGR5 receptor expressed in HEK293 cells assessed as intracellular cAMP level
In DepthDetails ArticlePubMed