BDBM50328524 5,6-Dichloro-2-{(2S)-1-[2-methylalanyl-(betaS)-beta-methyl-L-phenylalanyl]pyrrolidin-2-yl}-1H-benzimidazole::CHEMBL1259207
SMILES C[C@H]([C@H](NC(=O)C(C)(C)N)C(=O)N1CCC[C@H]1c1nc2cc(Cl)c(Cl)cc2[nH]1)c1ccccc1
InChI Key InChIKey=BRJWVZQAVMCCBY-WVFSVQOHSA-N
Data  4 IC50
  Tab Delimited (TSV)   2D SDfile   Computed 3D by Vconf -m prep SDfile
Find this compound or compounds like it in BindingDB:
Activity Spreadsheet -- Enzyme Inhibition Constant Data from BindingDB
Found 4 hits for monomerid = 50328524
TargetLysosomal Pro-X carboxypeptidase(Mus musculus)
Merck Research Laboratories
Curated by ChEMBL
LigandPNGBDBM50328524(5,6-Dichloro-2-{(2S)-1-[2-methylalanyl-(betaS)-bet...)
Affinity DataIC50:  60nM. Assay description: Inhibition of mouse PrCP by FRET in presence of 1% mouse serum albumin
In DepthDetails ArticlePubMed
TargetLysosomal Pro-X carboxypeptidase(Mus musculus)
Merck Research Laboratories
Curated by ChEMBL
LigandPNGBDBM50328524(5,6-Dichloro-2-{(2S)-1-[2-methylalanyl-(betaS)-bet...)
Affinity DataIC50:  32nM. Assay description: Inhibition of mouse PrCP by FRET
In DepthDetails ArticlePubMed
TargetLysosomal Pro-X carboxypeptidase(Homo sapiens (Human))
Merck Research Laboratories
Curated by ChEMBL
LigandPNGBDBM50328524(5,6-Dichloro-2-{(2S)-1-[2-methylalanyl-(betaS)-bet...)
Affinity DataIC50:  10nM. Assay description: Inhibition of human PrCP by FRET in presence of 1% mouse serum albumin
In DepthDetails ArticlePubMed
TargetLysosomal Pro-X carboxypeptidase(Homo sapiens (Human))
Merck Research Laboratories
Curated by ChEMBL
LigandPNGBDBM50328524(5,6-Dichloro-2-{(2S)-1-[2-methylalanyl-(betaS)-bet...)
Affinity DataIC50:  5nM. Assay description: Inhibition of human PrCP by FRET
In DepthDetails ArticlePubMed