BDBM50328557 3-(4'-Methylbiphenyl-4-yl)-1-[(2S)-2-(4-phenyl-1H-imidazol-2-yl)pyrrolidin-1-yl]propan-1-one::CHEMBL1259027
SMILES Cc1ccc(cc1)-c1ccc(CCC(=O)N2CCC[C@H]2c2nc(c[nH]2)-c2ccccc2)cc1
InChI Key InChIKey=SHDFCIGPOVYVRI-MHZLTWQESA-N
Data  1 IC50
  Tab Delimited (TSV)   2D SDfile   Computed 3D by Vconf -m prep SDfile
Find this compound or compounds like it in BindingDB:
Activity Spreadsheet -- Enzyme Inhibition Constant Data from BindingDB
Found 1 hit for monomerid = 50328557
TargetLysosomal Pro-X carboxypeptidase(Homo sapiens (Human))
Merck Research Laboratories
Curated by ChEMBL
LigandPNGBDBM50328557(3-(4'-Methylbiphenyl-4-yl)-1-[(2S)-2-(4-phenyl-1H-...)
Affinity DataIC50:  56nM. Assay description: Inhibition of human PrCP by FRET
In DepthDetails ArticlePubMed