BDBM50328731 CHEMBL1269025::Edoxaban
SMILES CN(C)C(=O)[C@H]1CC[C@H](NC(=O)C(=O)Nc2ccc(Cl)cn2)[C@@H](C1)NC(=O)c1nc2CCN(C)Cc2s1
InChI Key InChIKey=HGVDHZBSSITLCT-JLJPHGGASA-N
Data  1 KI  2 IC50
  Tab Delimited (TSV)   2D SDfile   Computed 3D by Vconf -m prep SDfile
Find this compound or compounds like it in BindingDB:
Activity Spreadsheet -- Enzyme Inhibition Constant Data from BindingDB
Found 2 hits for monomerid = 50328731
TargetCoagulation factor X(Homo sapiens (Human))
Bristol-Myers Squibb
Curated by ChEMBL
LigandPNGBDBM50328731(CHEMBL1269025 | Edoxaban)
Affinity DataIC50:  3.40nM. Assay description: Inhibition of human factor Xa using Z-D-Arg-Gly-Arg-pNA.2HCl as substrate preincubated for 15 mins followed by substrate addition by UV absorption an...
In DepthDetails ArticlePubMedDrugBank
TargetCoagulation factor X(Homo sapiens (Human))
Bristol-Myers Squibb
Curated by ChEMBL
LigandPNGBDBM50328731(CHEMBL1269025 | Edoxaban)
Affinity DataIC50:  3.40nM. Assay description: Inhibition of human coagulation factor 10a using Z-D-Arg-Gly-Arg-pNA.2HCl as substrate preincubated for 15 mins followed by substrate addition by UV ...
In DepthDetails ArticlePubMedDrugBank