BDBM50329414 2-(4-Methoxy-phenyl)-5-pyridin-4-yl-1H-pyrrole-3-carboxamide::CHEMBL1270424::US9670191, A12
SMILES COc1ccc(cc1)-c1[nH]c(cc1C(N)=O)-c1ccncc1
InChI Key InChIKey=JAKVUTLQQQVGSN-UHFFFAOYSA-N
Data  2 IC50
  Tab Delimited (TSV)   2D SDfile   Computed 3D by Vconf -m prep SDfile
Find this compound or compounds like it in BindingDB:
Activity Spreadsheet -- Enzyme Inhibition Constant Data from BindingDB
Found 2 hits for monomerid = 50329414
TargetCell division cycle 7-related protein kinase [58-574]/Protein DBF4 homolog A(Homo sapiens (Human))
Nerviano Medical Sciences
US Patent
LigandPNGBDBM50329414(2-(4-Methoxy-phenyl)-5-pyridin-4-yl-1H-pyrrole-3-c...)
Affinity DataIC50: <100nM. Assay description: The assay consists of the transfer of radioactivity labeled phosphate moiety by the kinase to an acceptor substrate. The resulting 33P-labeled produc...
In DepthDetails US Patent
TargetCell division cycle 7-related protein kinase(Homo sapiens (Human))
Nerviano Medical Sciences
Curated by ChEMBL
LigandPNGBDBM50329414(2-(4-Methoxy-phenyl)-5-pyridin-4-yl-1H-pyrrole-3-c...)
Affinity DataIC50:  23nM. Assay description: Inhibition of Cdc7
In DepthDetails ArticlePubMed