BDBM50330415 (R)-N-(2-(4'-(2-(methylsulfonamido)ethyl)biphenyl-4-yl)propyl)propane-2-sulfonamide::CHEMBL1277001
SMILES CC(C)S(=O)(=O)NC[C@H](C)c1ccc(cc1)-c1ccc(CCNS(C)(=O)=O)cc1
InChI Key InChIKey=ULRDYYKSPCRXAJ-KRWDZBQOSA-N
Data  1 EC50
PDB links: 1 PDB ID matches this monomer.
  Tab Delimited (TSV)   2D SDfile   Computed 3D by Vconf -m prep SDfile
Find this compound or compounds like it in BindingDB:
Activity Spreadsheet -- Enzyme Inhibition Constant Data from BindingDB
Found 1 hit for monomerid = 50330415
TargetGlutamate receptor 4(Homo sapiens (Human))
Merck Research Laboratories
Curated by ChEMBL
LigandPNGBDBM50330415((R)-N-(2-(4'-(2-(methylsulfonamido)ethyl)biphenyl-...)
Affinity DataEC50:  150nM. Assay description: Inhibition of GluR4 expressed in HEK293 cells
In DepthDetails ArticlePubMed