BDBM50330670 2-(3,4-Dimethylbenzyl)-3-[2-(4-hydroxy-2-iodo-5-methoxyphenyl)acetamido]propyl pivalate::CHEMBL1276854
SMILES COc1cc(CC(=O)NCC(COC(=O)C(C)(C)C)Cc2ccc(C)c(C)c2)c(I)cc1O
InChI Key InChIKey=WLDBQLPWNOOQGM-UHFFFAOYSA-N
Data  1 KI
  Tab Delimited (TSV)   2D SDfile   Computed 3D by Vconf -m prep SDfile
Find this compound or compounds like it in BindingDB:
Activity Spreadsheet -- Enzyme Inhibition Constant Data from BindingDB
Found 1 hit for monomerid = 50330670
TargetTransient receptor potential cation channel subfamily V member 1(Rattus norvegicus (rat))
Seoul National University
Curated by ChEMBL
LigandPNGBDBM50330670(2-(3,4-Dimethylbenzyl)-3-[2-(4-hydroxy-2-iodo-5-me...)
Affinity DataKi:  116nM. Assay description: Displacement of [3H]RTX from rat TRPV1 expressed in CHO cells
In DepthDetails ArticlePubMed