BDBM50330785 4-({[(dihydroxyboranyl)methyl]sulfamoyl}methyl)benzoic acid::CHEMBL1231477::[(4-Carboxyphenyl)methanesulfonylamino]methaneboronic Acid
SMILES OB(O)CNS(=O)(=O)Cc1ccc(cc1)C(O)=O
InChI Key InChIKey=XFGLPAZMEWKDFW-UHFFFAOYSA-N
Data  2 IC50
PDB links: 1 PDB ID matches this monomer.
  Tab Delimited (TSV)   2D SDfile   Computed 3D by Vconf -m prep SDfile
Find this compound or compounds like it in BindingDB:
Activity Spreadsheet -- Enzyme Inhibition Constant Data from BindingDB
Found 1 hit for monomerid = 50330785
TargetCruzipain(Trypanosoma cruzi)
University Of California San Francisco
Curated by ChEMBL
LigandPNGBDBM50330785(4-({[(dihydroxyboranyl)methyl]sulfamoyl}methyl)ben...)
Affinity DataIC50: >5.00E+5nM. Assay description: Inhibition of Trypanosoma cruzi cruzaine
In DepthDetails ArticlePubMed