BDBM50334451 (S)-2-(4-fluorophenyl)-7-(quinuclidin-3-yl)-7,8-dihydropyrazolo[3,4,5-de]isoquinolin-6(2H)-one::CHEMBL1643892::US8501729, 10
SMILES Fc1ccc(cc1)-n1[nH]c2cn([C@@H]3CN4CCC3CC4)c(=O)c3cccc1c23
InChI Key InChIKey=YKQUIJWABGQLEP-HXUWFJFHSA-N
Data  2 KI
  Tab Delimited (TSV)   2D SDfile   Computed 3D by Vconf -m prep SDfile
Find this compound or compounds like it in BindingDB:
Activity Spreadsheet -- Enzyme Inhibition Constant Data from BindingDB
Found 2 hits for monomerid = 50334451
Target5-hydroxytryptamine receptor 3A(Homo sapiens (Human))
Albany Molecular Research
US Patent
LigandPNGBDBM50334451((S)-2-(4-fluorophenyl)-7-(quinuclidin-3-yl)-7,8-di...)
Affinity DataKi:  7nMpH: 7.5Assay Description:The relative affinity of the various compounds for the human 5-HT3 receptor was measured in a radioligand binding assay, using a scintillation proxim...
In DepthDetails US Patent
Target5-hydroxytryptamine receptor 3A(Homo sapiens (Human))
Albany Molecular Research
US Patent
LigandPNGBDBM50334451((S)-2-(4-fluorophenyl)-7-(quinuclidin-3-yl)-7,8-di...)
Affinity DataKi:  7.90nM. Assay description: Binding affinity to human 5HT3A receptor
In DepthDetails ArticlePubMed