BDBM50336618 CHEMBL4175581
SMILES CNC(=O)[C@H](CC(N)=O)NC(=O)[C@H](CCCNC(N)=N)NC(=O)[C@@H]1CCCN1C(=O)[C@H](CCCNC(N)=N)NC(=O)[C@H](Cc1ccccc1)NC(=O)[C@H](CC(C)C)NC(=O)[C@H](Cc1ccccc1)NC(=O)[C@H](Cc1ccc(O)cc1)NC(C)=O
InChI Key InChIKey=HRGCZQNCQLHYRL-QVWIHFFISA-N
Data  2 IC50  2 EC50
  Tab Delimited (TSV)   2D SDfile   Computed 3D by Vconf -m prep SDfile
Find this compound or compounds like it in BindingDB:
Activity Spreadsheet -- Enzyme Inhibition Constant Data from BindingDB
Found 4 hits for monomerid = 50336618
TargetNeuromedin-U receptor 2(Homo sapiens (Human))
Vrije Universiteit Brussel
Curated by ChEMBL
LigandPNGBDBM50336618(CHEMBL4175581)
Affinity DataIC50:  328nM. Assay description: Displacement of [3H]-NMU-8 from human NMUR2 expressed in HEK293 cells after 3 hrs by topcount micro scintillation counting method
In DepthDetails ArticlePubMed
TargetNeuromedin-U receptor 2(Homo sapiens (Human))
Vrije Universiteit Brussel
Curated by ChEMBL
LigandPNGBDBM50336618(CHEMBL4175581)
Affinity DataEC50:  441nM. Assay description: Agonist activity at human NMUR2 expressed in HEK293 cells assessed as IP3 accumulation after 60 mins in presence of myo-[2-3H(N)]inositol by scintill...
In DepthDetails ArticlePubMed
TargetNeuromedin-U receptor 1(Homo sapiens (Human))
Vrije Universiteit Brussel
Curated by ChEMBL
LigandPNGBDBM50336618(CHEMBL4175581)
Affinity DataIC50:  21nM. Assay description: Displacement of [3H]-NMU-8 from human NMUR1 expressed in HEK293 cells after 3 hrs by topcount micro scintillation counting method
In DepthDetails ArticlePubMed
TargetNeuromedin-U receptor 1(Homo sapiens (Human))
Vrije Universiteit Brussel
Curated by ChEMBL
LigandPNGBDBM50336618(CHEMBL4175581)
Affinity DataEC50:  843nM. Assay description: Agonist activity at human NMUR1 expressed in HEK293 cells assessed as IP3 accumulation after 60 mins in presence of myo-[2-3H(N)]inositol by scintill...
In DepthDetails ArticlePubMed